baratte
terme associe: T69-5927
created: 2012-05-16T00:00:00+02:00
modified: 2014-12-04T15:06:39+01:00
status: 1
type: Concept
broader: T69-3296
definition: Récipient avec instrument servant à transformer la crème de lait crue en beurre par agitation.
in scheme: T69
preferred label: churns @en-us
related: T69-5927