chaise
created: 2012-05-16T00:00:00+02:00
modified: 2014-12-05T12:23:01+01:00
status: 1
type: Concept
alternative label: chaise pour l'habit
broader: T69-6867
definition: Siège d'une place, à dossier, sans accotoirs.
in scheme: T69
preferred label: side chairs @en-us