meuble pour préparer le cochon
created: 2012-05-16T00:00:00+02:00
modified: 2014-12-04T15:10:58+01:00
status: 1
type: Concept
alternative label: auge à boudin
alternative label: auge à ébouillanter le cochon
alternative label: table à tuer le cochon
alternative label: table à égoutter le cochon
alternative label: treuil à cochon
alternative label: échelle à vider le cochon
broad match: http://vocab.getty.edu/aat/300199765
broader: T69-3281
definition: Meuble servant à abattre le cochon ou à en apprêter la chair.
in scheme: T69