meuble-moulin
terme associe: T69-4039
created: 2012-05-16T00:00:00+02:00
modified: 2014-10-10T16:50:13+02:00
status: 1
type: Concept
alternative label: meuble-moulin à café
alternative label: moulin horizontal
alternative label: moulin vertical
broader: T69-3347
definition: Meuble comprenant un instrument en bois ou en pierre servant à écraser des grains. Il peut comprendre un tiroir de réception.
in scheme: T69
related: T69-4039