meuble pour l'entretien du linge
created: 2012-05-16T00:00:00+02:00
modified: 2014-10-13T14:18:30+02:00
status: 1
type: Concept
alternative label: chaudière à lessive
alternative label: lave-linge
alternative label: machine à laver manuelle
alternative label: placard à lessive
alternative label: planche porte-linge
alternative label: planche à laver
alternative label: porte-cuve à lessive
alternative label: presse à linge
alternative label: siège porte-fer à repasser
alternative label: séchoir à linge
alternative label: tréteau à linge
alternative label: étendoir à linge
broader: T69-2636
definition: Meuble servant au lavage, à l’essorage, au séchage ou au repassage du linge.
in scheme: T69
narrower: T69-3379
narrower: T69-3385
narrower: T69-3387
narrower: T69-3389
narrower: T69-3406