cuve à lessive
terme associe: T69-4382
created: 2012-05-16T00:00:00+02:00
modified: 2014-12-05T11:19:46+01:00
status: 1
type: Concept
alternative label: cuve à frotter le linge
broader: T69-3378
definition: Récipient généralement circulaire, de grandes dimensions, percé d'un trou à la partie inférieure servant au lavage du linge par trempages répétés. Il est monté sur support indépendant, sur pieds fixes ou montant de fond, placé sur massif de maçonnerie ou encastré dans une niche.
in scheme: T69
related: T69-4382