essoreuse domestique
terme associe: T69-5553
created: 2012-05-16T00:00:00+02:00
modified: 2014-09-12T10:41:46+02:00
status: 1
type: Concept
broad match: http://vocab.getty.edu/aat/300024728
broader: T69-3378
definition: Machine servant à extraire l'eau du linge que l'on a lavé. Elle est constituée de deux rouleaux horizontaux éventuellement caoutchoutés ou d'une cuve centrifugeuse.
in scheme: T69
related: T69-5553