étuve
created: 2012-05-16T00:00:00+02:00
modified: 2014-10-13T14:22:54+02:00
status: 1
type: Concept
broad match: http://data.bnf.fr/ark:/12148/cb15073638c
broad match: http://vocab.getty.edu/aat/300024728
broader: T69-3378
definition: Meuble de bois ou d'osier qui, grâce à un réchaud situé en partie inférieure, permet de sécher ou chauffer du linge avant de s’habiller. Il peut être en forme de panier à couvercle mais sans fond ou de tambour parfois recouvert de papier peint.
in scheme: T69