table à laver
created: 2012-05-16T00:00:00+02:00
modified: 2014-10-13T14:25:19+02:00
status: 1
type: Concept
broad match: http://vocab.getty.edu/aat/300039548
broader: T69-3378
definition: Table servant à frotter le linge, avant ou après lavage dans la cuve à lessive. Le plateau, horizontal ou incliné, est porté par trois ou quatre pieds ou monté sur deux tréteaux.
in scheme: T69