banc à carder
created: 2012-05-16T00:00:00+02:00
modified: 2014-12-10T14:53:53+01:00
status: 1
type: Concept
broad match: Cardage
broader: T69-7889
definition: Banc, parfois à balancier, sur lequel est monté un peigne à carder, utilisé pour démêler les fibres textiles dont la partie inférieure est fixe et dont la partie supérieure comporte deux poignées. Il peut être muni d’un coffret dans lequel placer la laine cardée. Le banc à carder est parfois à balancier, la partie supérieure étant suspendue à une superstructure et comportant une poignée antérieure pour faciliter le travail.
in scheme: T69