broie
created: 2012-05-16T00:00:00+02:00
modified: 2014-12-10T14:54:53+01:00
status: 1
type: Concept
alternative label: broie à chanvre ou à lin
alternative label: broie à lames
alternative label: broie à rouleaux
broad match: http://data.bnf.fr/ark:/12148/cb11942815d
broad match: http://vocab.getty.edu/aat/300053751
broader: T69-7889
definition: Instrument qui sert, après le rouissage et le séchage (hâlage) de la tige de chanvre ou de lin, à séparer la filasse de la partie ligneuse (tille, tillots) et de l’étoupe (chenevotte), ainsi que les différentes fibres entre elles.
in scheme: T69
preferred label: breakers @en-us