dévidoir domestique
terme associe: T69-5879
created: 2012-05-16T00:00:00+02:00
modified: 2014-12-10T14:26:07+01:00
status: 1
type: Concept
broad match: http://data.bnf.fr/ark:/12148/cb15037337b
broad match: http://vocab.getty.edu/aat/300163224
broader: T69-4715
definition: Instrument utilisé pour faire passer le fil d’un support à un autre, pour le laver, le teindre ou le mettre en œuvre.
in scheme: T69
narrower: T69-3427
narrower: T69-3429
narrower: T69-3475
related: T69-5879