renvidoir
created: 2012-05-16T00:00:00+02:00
modified: 2014-12-10T14:48:29+01:00
status: 1
type: Concept
broad match: http://data.bnf.fr/ark:/12148/cb15037337b
broad match: http://vocab.getty.edu/aat/300163224
broader: T69-3425
definition: Instrument servant à mettre le fil en écheveau à partir du fuseau, de façon à le laver et le teindre.
in scheme: T69