étau à coudre les gants
created: 2012-05-16T00:00:00+02:00
modified: 2014-12-10T14:51:25+01:00
status: 1
type: Concept
broad match: http://data.bnf.fr/ark:/12148/cb120098433
broad match: http://vocab.getty.edu/aat/300163224
broader: T69-4715
definition: Instrument, monté sur un pied et muni d’une pince dont les mâchoires sont mues à la main ou par une pédale, permettant de présenter les parties à coudre d’un gant.
in scheme: T69