machine à tricoter domestique
terme associe: T69-5433
created: 2012-05-16T00:00:00+02:00
modified: 2014-10-17T12:02:19+02:00
status: 1
type: Concept
alternative label: tricotin
alternative label: tricotin à queue-de-rat
broader: T69-4715
definition: Machine à usage privé servant à réaliser des textiles à mailles.
in scheme: T69
preferred label: household knitting machines @en-us
related: T69-5433