peigne à égrener
created: 2012-05-16T00:00:00+02:00
modified: 2014-10-17T12:07:03+02:00
status: 1
type: Concept
broad match: http://vocab.getty.edu/aat/300239965
broader: T69-7889
definition: Peigne à rangée unique de longues dents qui sert à égrener les tiges de lin ou de chanvre. Il est éventuellement monté sur un banc ou fixé sur un bâti.
in scheme: T69