peigne à lin
created: 2012-05-16T00:00:00+02:00
modified: 2014-12-10T14:58:15+01:00
status: 1
type: Concept
alternative label: peigne à chanvre
broader: T69-7889
definition: Élément muni de rangées de dents de métal, sur lequel on passe les fibres de chanvre ou de lin pour en régulariser le sens et les nettoyer des derniers déchets après broyage.
in scheme: T69