quenouille
created: 2012-05-16T00:00:00+02:00
modified: 2014-12-10T15:00:39+01:00
status: 1
type: Concept
broader: T69-7896
definition: Bâton supportant à son sommet une matière textile dite filasse, qui doit être filée grâce au fuseau ou au rouet.
in scheme: T69
preferred label: distaffs @en-us