rouet
created: 2012-05-16T00:00:00+02:00
modified: 2014-12-10T15:03:09+01:00
status: 1
type: Concept
broader: T69-7896
definition: Instrument servant à tordre mécaniquement la filasse de laine, de lin ou de chanvre, la filoselle ou la bourrette de soie, et à embobiner le fil ainsi obtenu. Le travail manuel est réduit à l’étirage de la filasse et au tournage de la roue.
in scheme: T69
preferred label: spinning wheels @en-us