rouet à envider
created: 2012-05-16T00:00:00+02:00
modified: 2014-12-10T14:49:09+01:00
status: 1
type: Concept
broad match: http://data.bnf.fr/ark:/12148/cb155800549
broader: T69-3425
definition: Instrument servant à passer de l’écheveau à la canette, à la bobine, à la navette ou au fuseau de dentellière ou bien encore à assembler différents fils provenant d’une servante sur ces éléments. Il est constitué d’une grande roue actionnée par une manivelle entraînant grâce à une bielle, une petite roue souvent à plusieurs gorges, fixée sur un axe horizontal pointu, sur lequel sont enfilées la canette ou la bobine qui se remplissent progressivement par un fil.
in scheme: T69