caisse à plantes
terme associe: T69-4596
created: 2012-05-16T00:00:00+02:00
modified: 2014-10-15T16:01:55+02:00
status: 1
type: Concept
alternative label: caisse à oranger
broader: T69-512
definition: Caisse en bois à quatre pieds, plus ou moins hauts, servant à faire pousser des plantes en extérieur.
in scheme: T69
preferred label: planters (containers) @en-us
related: T69-4596