fumeuse
created: 2012-05-16T00:00:00+02:00
modified: 2014-12-05T12:57:22+01:00
status: 1
type: Concept
alternative label: fumeuse à dossier
alternative label: fumeuse à pupitre
broad match: Siège (meuble)
broader: T69-6867
definition: Siège sur lequel on s'assoit à califourchon pour fumer, à fond un peu plus bas que celui de la voyeuse assise. La fumeuse comporte parfois, comme la ponteuse, une boîte sous l'accoudoir, où se place le cas échéant le matériel de fumeur.
in scheme: T69
preferred label: smoking chairs (chairs for smoking) @en-us