meuble pour animal familier
terme associe: T69-9568
created: 2012-05-16T00:00:00+02:00
modified: 2014-12-05T11:13:49+01:00
status: 1
type: Concept
alternative label: aquarium
alternative label: cage à oiseaux
alternative label: niche à chien
alternative label: perchoir d'intérieur
alternative label: porte-aquarium
alternative label: porte-cage
broader: T69-2636
definition: Abri, récipient, support, etc, propre à accueillir un animal familier dans l’espace domestique.
in scheme: T69
preferred label: animal husbandry containers @en-us
related: T69-9568