glace de trumeau
terme associe: T69-321
created: 2012-05-16T00:00:00+02:00
modified: 2014-12-04T11:00:34+01:00
status: 1
type: Concept
broad match: http://data.bnf.fr/ark:/12148/cb159721071
broader: T69-3523
definition: Panneau d'applique de dimensions importantes, constitué d'un ou plusieurs éléments de glace encadrés et fixés au mur ou dans une boiserie. Il est placé entre deux ouvertures ou sur une cheminée et parfois peint dans sa partie supérieure.
in scheme: T69
preferred label: overmantel mirrors @en-us
related: T69-321