miroir à barbe
created: 2012-05-16T00:00:00+02:00
modified: 2014-12-04T11:04:37+01:00
status: 1
type: Concept
broad match: cb13162911m
broader: T69-3523
definition: Petit miroir circulaire monté sur un pied élevé et exhaussable/réglable portant au sol, servant à se raser debout. Il peut comporter une petite tablette circulaire à hauteur de manipulation et éventuellement un coffret ou un tiroir, parfois des luminaires.
in scheme: T69
preferred label: shaving stands @en-us