globe de mariage
terme associe: T69-4548
terme associe: T69-7960
created: 2012-05-16T00:00:00+02:00
modified: 2014-12-05T11:11:04+01:00
status: 1
type: Concept
alternative label: bouquet de mariée
alternative label: boîte à bouquet de mariée
alternative label: boîte à couronne de mariée
alternative label: couronne de mariée
alternative label: coussin de mariage
broader: T69-3536
definition: Globe en verre sous lequel on place, afin de les conserver, un ou des souvenirs liés au mariage. Il peut s'agir d'un bouquet ou de la couronne de mariée qui peut être présentée posée ou non sur un coussin et associée ou non au bouquet de mariée.
in scheme: T69
related: T69-4548
related: T69-7960