secrétaire en pente
created: 2012-05-16T00:00:00+02:00
modified: 2014-12-05T11:47:11+01:00
status: 1
type: Concept
broad match: cb12647759k
broader: T69-3558
definition: Secrétaire comportant un panneau incliné servant, une fois ouvert, d'écritoire. Ce panneau est maintenu à l'horizontale par des tirettes, des charnières à arrêt, des compas ou par encastrement sous la partie fixe postérieure.
in scheme: T69
preferred label: slant-front desks @en-us