meuble à transformation
created: 2012-05-16T00:00:00+02:00
modified: 2014-10-10T15:51:34+02:00
status: 1
type: Concept
alternative label: siège à transformations
alternative label: table à transformations
broad match: Meuble
broader: T69-2636
definition: Meuble dont les différentes fonctions sont remplies alternativement par modification de la position des éléments.
in scheme: T69
preferred label: folding furniture @en-us