passoire
terme associe: T69-4055
created: 2012-05-16T00:00:00+02:00
modified: 2014-12-08T12:52:06+01:00
status: 1
type: Concept
alternative label: chinois
alternative label: couloir à lait
alternative label: panier à salade
alternative label: passe-lait
alternative label: passoire à macérer
broad match: cb11956938h
broader: T69-3582
definition: Récipient, entièrement ou partiellement ajouré, qui peut comporter des éléments de prise et un ou plusieurs pieds.
in scheme: T69
preferred label: colanders @en-us
related: T69-4055