pot à filtrer
created: 2012-05-16T00:00:00+02:00
modified: 2014-12-08T12:55:39+01:00
status: 1
type: Concept
alternative label: pot à filtrer l'eau-de-vie
alternative label: pot à filtrer les macérations
alternative label: pot à tisane
broad match: cb12330782p
broad match: http://vocab.getty.edu/aat/300198758
broader: T69-3582
definition: Récipient en terre cuite souvent sans glaçure, dans lequel on filtre une macération ou une décoction ; il est constitué d'un corps plus ou moins pansu, muni d'une anse latérale et d'un goulot, et fermé par une paroi perforée concave sur laquelle sont retenus les aliments ayant macéré.
in scheme: T69