mobilier monumental ou de l'espace extérieur
created: 2012-05-16T00:00:00+02:00
modified: 2014-10-15T15:57:43+02:00
status: 1
type: Concept
broad match: cb13163003r
broad match: Mobilier
definition: Mobilier implanté généralement dans un espace extérieur, public ou privé. Il peut s’agir de mobilier monumental, de mobilier commémoratif, de mobilier urbain, de mobilier de jardin, etc.
in scheme: T69
narrower: T69-364
narrower: T69-426
narrower: T69-464
narrower: T69-500
narrower: T69-512
narrower: T69-6718
preferred label: outdoor furniture @en-us