bouilloire
terme associe: T69-3902
created: 2012-05-16T00:00:00+02:00
modified: 2014-12-08T12:12:56+01:00
status: 1
type: Concept
alternative label: coquemar
alternative label: marabout
broader: T69-3653
definition: Récipient verseur couvert, en métal, servant à faire chauffer de l'eau. Plus ou moins sphérique, à large fond plat et goulot latéral coudé, la bouilloire est munie sur le dessus d'une anse mobile ou fixe qui permet de la suspendre à la crémaillère.
in scheme: T69
preferred label: teakettles @en-us
related: T69-3902