chaudron
terme associe: T69-4382
created: 2012-05-16T00:00:00+02:00
modified: 2014-12-08T12:16:48+01:00
status: 1
type: Concept
alternative label: chaudron à soupe
broader: T69-3653
definition: Récipient en métal que l'on suspend à une crémaillère par une anse supérieure mobile. Le chaudron est aussi haut que large, plus ou moins galbé, à fond légèrement arrondi et possède ou non des pieds et un couvercle.
in scheme: T69
preferred label: cauldrons @en-us
related: T69-4382