croix de consécration
terme associe: T69-1452
created: 2012-05-16T00:00:00+02:00
modified: 2015-02-24T12:43:53+01:00
status: 1
type: Concept
broader: T69-364
definition: L’une des douze croix gravées, sculptées ou peintes sur les murs, les colonnes ou les piliers d'une église consacrée et destinées à perpétuer le souvenir des croix tracées par le prélat consécrateur pendant la cérémonie de dédicace.
in scheme: T69
preferred label: consecration crosses @en-us
preferred label: croce di consacrazione @it
related: T69-1452