réchaud
terme associe: T69-3263
terme associe: T69-4144
created: 2012-05-16T00:00:00+02:00
modified: 2014-12-08T12:36:40+01:00
status: 1
type: Concept
broader: T69-3653
definition: Récipient en poterie ou en métal, sur pieds ou à fond plat. Il sert de support à un autre récipient dont le contenu cuit ou réchauffe grâce à des braises situées dans sa partie inférieure. Il peut être complété par des anses latérales ou une anse supérieure mobile.
in scheme: T69
preferred label: chafing dishes @en-us
related: T69-3263
related: T69-4144