monument funéraire
terme associe: T69-1520
terme associe: T69-758
terme associe: T69-926
terme associe: T69-931
created: 2012-05-16T00:00:00+02:00
modified: 2015-02-24T14:24:34+01:00
status: 1
type: Concept
alternative label: monument sépulcral
broader: T69-364
definition: Monument élevé à la mémoire d’un ou plusieurs morts.
in scheme: T69
narrower: T69-367
narrower: T69-380
narrower: T69-382
narrower: T69-385
narrower: T69-392
narrower: T69-394
narrower: T69-401
narrower: T69-403
preferred label: sepulchral monuments @en-us
preferred label: monumento funebre @it
related: T69-1520
related: T69-758
related: T69-926
related: T69-931
scope note: Voir aussi le Thesaurus de la désignation des œuvres architecturales et des espaces aménagés.