rôtissoire à fruits
created: 2012-05-16T00:00:00+02:00
modified: 2014-10-16T16:47:44+02:00
status: 1
type: Concept
alternative label: cuit-poires
alternative label: cuit-pommes
alternative label: rôtissoire à oiseaux
broad match: cb16558490q
broad match: http://vocab.getty.edu/aat/300196792
broader: T69-3780
definition: Rôtissoire constituée d'une ou plusieurs gouttières, verticales ou horizontales, munies d'anses et souvent de pieds, dans lesquelles on place des fruits ou des petits oiseaux.
in scheme: T69