assiette
created: 2012-05-16T00:00:00+02:00
modified: 2014-12-08T16:26:39+01:00
status: 1
type: Concept
alternative label: assiette calotte
alternative label: assiette creuse
alternative label: assiette d'accordailles
alternative label: assiette de baptême
alternative label: assiette patronymique
alternative label: assiette plate
alternative label: assiette à artichaut
alternative label: assiette à asperges
alternative label: assiette à bouillie
alternative label: assiette à compartiments
alternative label: assiette à coquillages
alternative label: assiette à dessert
alternative label: assiette à escargots
alternative label: assiette à l'italienne
alternative label: assiette à rôti
alternative label: assiette à salade
alternative label: assiette à œufs
alternative label: assiette-réchaud
broader: T69-3800
definition: Récipient individuel plat, le plus souvent circulaire, composé d'un bassin, constitué par le fond entouré d'un talus, ou descente, généralement bordé par un marli, couronne horizontale ou oblique à contours variés et profil droit ou galbé. L’assiette peut être désignée par sa forme (assiette plate), sa destination (assiette à dessert), son décor (assiette de baptême). Une série d’assiettes peut faire partie d’un service.
in scheme: T69
preferred label: plates (dishes) @en-us