assiette montée
terme associe: T69-3865
terme associe: T69-3887
terme associe: T69-4116
terme associe: T69-4153
created: 2012-05-16T00:00:00+02:00
modified: 2014-12-08T16:27:35+01:00
status: 1
type: Concept
alternative label: assiette montée double
alternative label: guéridon
alternative label: serviteur muet
broad match: http://data.bnf.fr/ark:/12148/cb150560668
broader: T69-3800
definition: Assiette de service plus ou moins creuse ou plateau sans marli, en céramique, métal ou verre, montée sur un pied, pour la présentation d'aliments sucrés ou de tasses à glaces. L’assiette montée peut être constituée d’un ou plusieurs plateaux ou corbeilles superposés et peut fonctionner par paire.
in scheme: T69
preferred label: pedestal plates @en-us
related: T69-3865
related: T69-3887
related: T69-4116
related: T69-4153