beurrier
created: 2012-05-16T00:00:00+02:00
modified: 2014-10-17T10:57:29+02:00
status: 1
type: Concept
alternative label: beurrier-conservateur
alternative label: beurrier-rafraîchisseur
alternative label: cloche à beurre
alternative label: coquille à beurre
broader: T69-3800
definition: Récipient en céramique ou en verre pour le service du beurre. Généralement couvert et souvent porté par un plateau assorti, il peut adopter la forme d'une coquille ou d'une assiette accompagnée d’une cloche.
in scheme: T69
preferred label: butter dishes (serving dishes) @en-us