croix funéraire
created: 2012-05-16T00:00:00+02:00
modified: 2015-02-24T14:39:24+01:00
status: 1
type: Concept
broader: T69-377
definition: Croix reposant habituellement sur un petit socle ou un support et indiquant l'emplacement d'une tombe. La croix est généralement placée à la tête du défunt.
in scheme: T69
preferred label: grave crosses @en-us
preferred label: croce tombale @it