boîte à thé ou à café
terme associe: T69-3986
terme associe: T69-4176
created: 2012-05-16T00:00:00+02:00
modified: 2014-12-08T16:32:30+01:00
status: 1
type: Concept
alternative label: bouteille à thé
alternative label: boîte à café
alternative label: boîte à thé
broader: T69-3800
definition: Petit récipient en métal ou en céramique servant à conserver les feuilles de thé ou la poudre de café. Elle se présente sous forme de boîte à couvercle ou de bouteille trapue à large goulot court fermé par un bouchon vissé.
in scheme: T69
related: T69-3986
related: T69-4176
scope note: Ne pas confondre la boîte à thé ou à café, objet précieux qui fait partie d'un service ou d'un nécessaire de voyage, avec la boîte de ménage qui est un pot à conserves.