coquetier
created: 2012-05-16T00:00:00+02:00
modified: 2014-12-08T16:35:03+01:00
status: 1
type: Concept
broader: T69-3800
definition: Petit récipient sur pied, dans lequel on dispose verticalement un œuf pour le manger. Le pied de certains coquetiers peut constituer, une fois retourné, un réceptacle pour y placer l'œuf horizontalement.
in scheme: T69
preferred label: eggcups @en-us