coupe à glace
created: 2012-05-16T00:00:00+02:00
modified: 2014-10-17T11:07:57+02:00
status: 1
type: Concept
broader: T69-3800
definition: Récipient généralement en verre ou en métal, hémisphérique, sur pied plus ou moins haut, pour le service et la consommation d'un dessert glacé.
in scheme: T69