huilier-vinaigrier
terme associe: T69-4153
created: 2012-05-16T00:00:00+02:00
modified: 2014-12-08T16:42:33+01:00
status: 1
type: Concept
alternative label: bouteille à huile
alternative label: bouteille à vinaigre
alternative label: huilier-guédoufle
alternative label: porte huilier-vinaigrier
broader: T69-3800
definition: Paire de petites bouteilles, brocs ou carafes en verre ou céramique, pour l'huile et le vinaigre, posés sur un plateau ou encastrés dans un récipient adapté ou dans une monture porte huilier-vinaigrier). Il peut être assorti à un moutardier, à une saupoudreuse (etc.) et faire partie d'un service à ingrédients ou d'un surtout.
in scheme: T69
preferred label: cruet sets @en-us
related: T69-4153