légumier
created: 2012-05-16T00:00:00+02:00
modified: 2014-12-08T16:47:43+01:00
status: 1
type: Concept
broader: T69-3800
definition: Récipient bas, couvert, en terre cuite, argent ou métal argenté, pour servir les légumes cuits. Généralement circulaire, à fond plat ou sur pied bas et à anses latérales horizontales, il peut être posé sur un plateau ou un présentoir assortis et indépendants. Il est souvent assorti à la soupière.
in scheme: T69
preferred label: vegetable dishes @en-us