poêlon de table
terme associe: T69-3671
terme associe: T69-4144
created: 2012-05-16T00:00:00+02:00
modified: 2014-10-17T11:22:48+02:00
status: 1
type: Concept
alternative label: pot à bouchée
alternative label: poêlon à ris de veau
alternative label: poêlon à truffes
alternative label: poêlon à œuf
broad match: cb13184671j
broader: T69-3800
definition: Récipient, généralement en forme de casserole basse, couvert ou non, en argent, métal argenté, faïence ou porcelaine, que l'on utilise sur la table, posé ou non sur un réchaud.
in scheme: T69
related: T69-3671
related: T69-4144