pot à crème
terme associe: T69-3803
terme associe: T69-4116
created: 2012-05-16T00:00:00+02:00
modified: 2014-12-08T16:58:21+01:00
status: 1
type: Concept
alternative label: pot à jus
broader: T69-3800
definition: Petit récipient circulaire généralement couvert, en céramique, à fond plat ou sur pied bas, muni d'une anse latérale, contenant une portion individuelle de crème. Les pots à crème sont toujours en série, parfois disposés sur un plateau ou une assiette montée assortis ou encastrés dans une monture métallique.
in scheme: T69
preferred label: custard cups @en-us
related: T69-3803
related: T69-4116