saladier
created: 2012-05-16T00:00:00+02:00
modified: 2014-12-10T13:03:46+01:00
status: 1
type: Concept
alternative label: jatte à salade
broader: T69-3800
definition: Grand récipient circulaire, en terre cuite ou en verre, avec ou sans pied bas et sans anses, dans lequel on assaisonne et on sert la salade.
in scheme: T69
preferred label: salad bowls @en-us