sucrier
terme associe: T69-3955
terme associe: T69-3986
created: 2012-05-16T00:00:00+02:00
modified: 2014-12-10T13:23:48+01:00
status: 1
type: Concept
alternative label: pot à sucre
alternative label: sucrier à sucre en poudre
broad match: http://data.bnf.fr/ark:/12148/cb137554066
broader: T69-3800
definition: Récipient couvert, en terre cuite, métal ou verre, circulaire ou ovale, comportant deux anses latérales, posé sur un ou plusieurs pieds bas et contenant le sucre en morceaux ou en poudre.
in scheme: T69
narrower: T69-3885
preferred label: sugar bowls @en-us
related: T69-3955
related: T69-3986